Reaction Details
TargetMetabotropic glutamate receptor 8
LigandBDBM50174527
Substrate/Competitorn/a
Meas. Tech.ChEMBL_445957 (CHEMBL896250)
EC50 412000±n/a nM
Citation Selvam, CGoudet, COueslati, NPin, JPAcher, FC L-(+)-2-Amino-4-thiophosphonobutyric acid (L-thioAP4), a new potent agonist of group III metabotropic glutamate receptors: increased distal acidity affords enhanced potency. J Med Chem50:4656-64 (2007) 
 
Metabotropic glutamate receptor 8
Name:Metabotropic glutamate receptor 8
Type:Enzyme
Mol. Mass.:101886.18
Organism:Rattus norvegicus (Rat)
Description:P70579
Residue:908
BDBM50174527
NameBDBM50174527
Synonyms:(S)-2-Amino-4-(hydroxy-methyl-phosphinoyl)-butyric acid; hydrochloride CHEMBL535153
TypeSmall organic molecule
Emp. Form.C5H12NO4P
Mol. Mass.181.1268
SMILESCP(O)(=O)CC[C@H](N)C(O)=O