Reaction Details
TargetKinesin-like protein KIF11
LigandBDBM50220155
Substrate/Competitorn/a
Meas. Tech.ChEMBL_446063 (CHEMBL895158)
IC50 28±n/a nM
Citation Parrish, CAAdams, NDAuger, KRBurgess, JLCarson, JDChaudhari, AMCopeland, RADiamond, MADonatelli, CADuffy, KJFaucette, LFFiner, JTHuffman, WFHugger, EDJackson, JRKnight, SDLuo, LMoore, MLNewlander, KARidgers, LHSakowicz, RShaw, ANSung, CMSutton, DWood, KWZhang, SYZimmerman, MNDhanak, D Novel ATP-competitive kinesin spindle protein inhibitors. J Med Chem50:4939-52 (2007) 
 
Kinesin-like protein KIF11
Name:Kinesin-like protein KIF11
Type:PROTEIN
Mol. Mass.:119138.97
Organism:Homo sapiens (Human)
Description:ChEMBL_1457426
Residue:1056
BDBM50220155
NameBDBM50220155
Synonyms:CHEMBL244697 | N-[3'-nitro-4'-(trifluoromethyl)-4-biphenylyl]sulfamide
TypeSmall organic molecule
Emp. Form.C13H10F3N3O4S
Mol. Mass.361.296
SMILESNS(=O)(=O)Nc1ccc(cc1)-c1ccc(c(c1)[N+]([O-])=O)C(F)(F)F