Reaction Details
TargetKinesin-like protein KIF11
LigandBDBM50220162
Substrate/Competitorn/a
Meas. Tech.ChEMBL_446063 (CHEMBL895158)
IC50 39±n/a nM
Citation Parrish, CAAdams, NDAuger, KRBurgess, JLCarson, JDChaudhari, AMCopeland, RADiamond, MADonatelli, CADuffy, KJFaucette, LFFiner, JTHuffman, WFHugger, EDJackson, JRKnight, SDLuo, LMoore, MLNewlander, KARidgers, LHSakowicz, RShaw, ANSung, CMSutton, DWood, KWZhang, SYZimmerman, MNDhanak, D Novel ATP-competitive kinesin spindle protein inhibitors. J Med Chem50:4939-52 (2007) 
 
Kinesin-like protein KIF11
Name:Kinesin-like protein KIF11
Type:PROTEIN
Mol. Mass.:119138.97
Organism:Homo sapiens (Human)
Description:ChEMBL_1457426
Residue:1056
BDBM50220162
NameBDBM50220162
Synonyms:CHEMBL243883 | N-[4'-(trifluoromethyl)-4-biphenylyl]urea
TypeSmall organic molecule
Emp. Form.C14H11F3N2O
Mol. Mass.280.2451
SMILESNC(=O)Nc1ccc(cc1)-c1ccc(cc1)C(F)(F)F