Reaction Details
TargetKinesin-like protein KIF11
LigandBDBM50220192
Substrate/Competitorn/a
Meas. Tech.ChEMBL_446063 (CHEMBL895158)
IC50 57±n/a nM
Citation Parrish, CAAdams, NDAuger, KRBurgess, JLCarson, JDChaudhari, AMCopeland, RADiamond, MADonatelli, CADuffy, KJFaucette, LFFiner, JTHuffman, WFHugger, EDJackson, JRKnight, SDLuo, LMoore, MLNewlander, KARidgers, LHSakowicz, RShaw, ANSung, CMSutton, DWood, KWZhang, SYZimmerman, MNDhanak, D Novel ATP-competitive kinesin spindle protein inhibitors. J Med Chem50:4939-52 (2007) 
 
Kinesin-like protein KIF11
Name:Kinesin-like protein KIF11
Type:PROTEIN
Mol. Mass.:119138.97
Organism:Homo sapiens (Human)
Description:ChEMBL_1457426
Residue:1056
BDBM50220192
NameBDBM50220192
Synonyms:CHEMBL397249 | N-(4'-isopropyl-4-biphenylyl)urea
TypeSmall organic molecule
Emp. Form.C16H18N2O
Mol. Mass.254.3269
SMILESCC(C)c1ccc(cc1)-c1ccc(NC(N)=O)cc1