Reaction Details
TargetKinesin-like protein KIF11
LigandBDBM50220188
Substrate/Competitorn/a
Meas. Tech.ChEMBL_446063 (CHEMBL895158)
IC50 54±n/a nM
Citation Parrish, CAAdams, NDAuger, KRBurgess, JLCarson, JDChaudhari, AMCopeland, RADiamond, MADonatelli, CADuffy, KJFaucette, LFFiner, JTHuffman, WFHugger, EDJackson, JRKnight, SDLuo, LMoore, MLNewlander, KARidgers, LHSakowicz, RShaw, ANSung, CMSutton, DWood, KWZhang, SYZimmerman, MNDhanak, D Novel ATP-competitive kinesin spindle protein inhibitors. J Med Chem50:4939-52 (2007) 
 
Kinesin-like protein KIF11
Name:Kinesin-like protein KIF11
Type:PROTEIN
Mol. Mass.:119138.97
Organism:Homo sapiens (Human)
Description:ChEMBL_1457426
Residue:1056
BDBM50220188
NameBDBM50220188
Synonyms:CHEMBL244126 | N-(4'-t-butyl-4-biphenylyl)urea
TypeSmall organic molecule
Emp. Form.C17H20N2O
Mol. Mass.268.3535
SMILESCC(C)(C)c1ccc(cc1)-c1ccc(NC(N)=O)cc1