Reaction Details
TargetHistone deacetylase 3
LigandBDBM50220232
Substrate/Competitorn/a
Meas. Tech.ChEMBL_449161 (CHEMBL899426)
IC50 939±n/a nM
Citation Hamblett, CLMethot, JLMampreian, DMSloman, DLStanton, MGKral, AMFleming, JCCruz, JCChenard, MOzerova, NHitz, AMWang, HDeshmukh, SVNazef, NHarsch, AHughes, BDahlberg, WKSzewczak, AAMiddleton, REMosley, RTSecrist, JPMiller, TA The discovery of 6-amino nicotinamides as potent and selective histone deacetylase inhibitors. Bioorg Med Chem Lett17:5300-9 (2007) 
 
Histone deacetylase 3
Name:Histone deacetylase 3
Type:Enzyme
Mol. Mass.:48829.55
Organism:Homo sapiens (Human)
Description:O15379
Residue:428
BDBM50220232
NameBDBM50220232
Synonyms:(S)-benzyl 4-(5-((2-aminophenyl)carbamoyl)pyridin-2-yl)-2-methylpiperazine-1-carboxylate CHEMBL236902
TypeSmall organic molecule
Emp. Form.C25H27N5O3
Mol. Mass.445.5136
SMILESC[C@H]1CN(CCN1C(=O)OCc1ccccc1)c1ccc(cn1)C(=O)Nc1ccccc1N