Reaction Details
TargetAmyloid-beta precursor protein
LigandBDBM50220270
Substrate/Competitorn/a
Meas. Tech.ChEMBL_449193 (CHEMBL899458)
IC50 2.4±n/a nM
Citation Josien, HBara, TRajagopalan, MAsberom, TClader, JWFavreau, LGreenlee, WJHyde, LANomeir, AAParker, EMPissarnitski, DASong, LWong, GTZhang, LZhang, QZhao, Z Small conformationally restricted piperidine N-arylsulfonamides as orally active gamma-secretase inhibitors. Bioorg Med Chem Lett17:5330-5 (2007) 
 
Amyloid-beta precursor protein
Name:Amyloid-beta precursor protein
Type:Single-pass type I membrane protein
Mol. Mass.:86890.41
Organism:Homo sapiens (Human)
Description:P05067
Residue:770
BDBM50220270
NameBDBM50220270
Synonyms:1-((2R,6S)-1-(4-chlorophenylsulfonyl)-6-(3,5-difluorophenyl)piperidin-2-yl)cyclopropyl 4-(2-hydroxyethyl)piperazine-1-carboxylate | CHEMBL239629
TypeSmall organic molecule
Emp. Form.C27H32ClF2N3O5S
Mol. Mass.584.075
SMILESOCCN1CCN(CC1)C(=O)OC1(CC1)[C@H]1CCC[C@H](N1S(=O)(=O)c1ccc(Cl)cc1)c1cc(F)cc(F)c1