Reaction Details
TargetAmyloid-beta precursor protein
LigandBDBM50220271
Substrate/Competitorn/a
Meas. Tech.ChEMBL_449193 (CHEMBL899458)
IC50 2.8±n/a nM
Citation Josien, HBara, TRajagopalan, MAsberom, TClader, JWFavreau, LGreenlee, WJHyde, LANomeir, AAParker, EMPissarnitski, DASong, LWong, GTZhang, LZhang, QZhao, Z Small conformationally restricted piperidine N-arylsulfonamides as orally active gamma-secretase inhibitors. Bioorg Med Chem Lett17:5330-5 (2007) 
 
Amyloid-beta precursor protein
Name:Amyloid-beta precursor protein
Type:Single-pass type I membrane protein
Mol. Mass.:86890.41
Organism:Homo sapiens (Human)
Description:P05067
Residue:770
BDBM50220271
NameBDBM50220271
Synonyms:1-((2R,6S)-1-(4-chlorophenylsulfonyl)-6-cyclopropylpiperidin-2-yl)cyclopropyl 4-(piperidin-1-yl)piperidine-1-carboxylate | CHEMBL400420
TypeSmall organic molecule
Emp. Form.C28H40ClN3O4S
Mol. Mass.550.153
SMILESClc1ccc(cc1)S(=O)(=O)N1[C@@H](CCC[C@@H]1C1(CC1)OC(=O)N1CCC(CC1)N1CCCCC1)C1CC1