Reaction Details
TargetAmyloid-beta precursor protein
LigandBDBM50220275
Substrate/Competitorn/a
Meas. Tech.ChEMBL_449193 (CHEMBL899458)
IC50 3.5±n/a nM
Citation Josien, HBara, TRajagopalan, MAsberom, TClader, JWFavreau, LGreenlee, WJHyde, LANomeir, AAParker, EMPissarnitski, DASong, LWong, GTZhang, LZhang, QZhao, Z Small conformationally restricted piperidine N-arylsulfonamides as orally active gamma-secretase inhibitors. Bioorg Med Chem Lett17:5330-5 (2007) 
 
Amyloid-beta precursor protein
Name:Amyloid-beta precursor protein
Type:Single-pass type I membrane protein
Mol. Mass.:86890.41
Organism:Homo sapiens (Human)
Description:P05067
Residue:770
BDBM50220275
NameBDBM50220275
Synonyms:1-((2R,6R)-1-(4-chlorophenylsulfonyl)-6-ethylpiperidin-2-yl)cyclopropyl 8-(2-hydroxyethyl)-3,8-diaza-bicyclo[3.2.1]octane-3-carboxylate | CHEMBL392060
TypeSmall organic molecule
Emp. Form.C25H36ClN3O5S
Mol. Mass.526.088
SMILESCC[C@@H]1CCC[C@@H](N1S(=O)(=O)c1ccc(Cl)cc1)C1(CC1)OC(=O)N1CC2CCC(C1)N2CCO