Reaction Details
TargetBeta-secretase 1
LigandBDBM50220308
Substrate/Competitorn/a
Meas. Tech.ChEMBL_449199 (CHEMBL899464)
IC50 1540±n/a nM
Citation Fobare, WFSolvibile, WRRobichaud, AJMalamas, MSManas, ETurner, JHu, YWagner, EChopra, RCowling, RJin, GBard, J Thiophene substituted acylguanidines as BACE1 inhibitors. Bioorg Med Chem Lett17:5353-6 (2007) 
 
Beta-secretase 1
Name:Beta-secretase 1
Type:Protein
Mol. Mass.:55755.10
Organism:Homo sapiens (Human)
Description:P56817
Residue:501
BDBM50220308
NameBDBM50220308
Synonyms:CHEMBL237282 | N-(amino(3-hydroxypropylamino)methylene)-2-(4-(2-chlorophenyl)-2-(3-methyl-4-propoxyphenyl)thiophen-3-yl)acetamide
TypeSmall organic molecule
Emp. Form.C26H30ClN3O3S
Mol. Mass.500.053
SMILESCCCOc1ccc(cc1C)-c1scc(c1CC(=O)NC(=N)NCCCO)-c1ccccc1Cl