Reaction Details
TargetBeta-secretase 1
LigandBDBM50220313
Substrate/Competitorn/a
Meas. Tech.ChEMBL_449199 (CHEMBL899464)
IC50 260±n/a nM
Citation Fobare, WFSolvibile, WRRobichaud, AJMalamas, MSManas, ETurner, JHu, YWagner, EChopra, RCowling, RJin, GBard, J Thiophene substituted acylguanidines as BACE1 inhibitors. Bioorg Med Chem Lett17:5353-6 (2007) 
 
Beta-secretase 1
Name:Beta-secretase 1
Type:Protein
Mol. Mass.:55755.10
Organism:Homo sapiens (Human)
Description:P56817
Residue:501
BDBM50220313
NameBDBM50220313
Synonyms:4-(3-(2-(amino(3-hydroxypropylamino)methyleneamino)-2-oxoethyl)-4-(2-chlorophenyl)thiophen-2-yl)-N-propylbenzamide | CHEMBL237284
TypeSmall organic molecule
Emp. Form.C26H29ClN4O3S
Mol. Mass.513.051
SMILESCCCNC(=O)c1ccc(cc1)-c1scc(c1CC(=O)NC(=N)NCCCO)-c1ccccc1Cl