Reaction Details
TargetBeta-secretase 1
LigandBDBM50220306
Substrate/Competitorn/a
Meas. Tech.ChEMBL_449199 (CHEMBL899464)
IC50 200±n/a nM
Citation Fobare, WFSolvibile, WRRobichaud, AJMalamas, MSManas, ETurner, JHu, YWagner, EChopra, RCowling, RJin, GBard, J Thiophene substituted acylguanidines as BACE1 inhibitors. Bioorg Med Chem Lett17:5353-6 (2007) 
 
Beta-secretase 1
Name:Beta-secretase 1
Type:Protein
Mol. Mass.:55755.10
Organism:Homo sapiens (Human)
Description:P56817
Residue:501
BDBM50220306
NameBDBM50220306
Synonyms:-4-(3-(2-(amino(3-hydroxypropylamino)methyleneamino)-2-oxoethyl)-4-(2-chlorophenyl)thiophen-2-yl)-N-(2,2,2-trifluoroethyl)benzamide | CHEMBL237283
TypeSmall organic molecule
Emp. Form.C25H24ClF3N4O3S
Mol. Mass.552.996
SMILESOCCCNC(=N)NC(=O)Cc1c(csc1-c1ccc(cc1)C(=O)NCC(F)(F)F)-c1ccccc1Cl