Reaction Details
TargetBeta-secretase 1
LigandBDBM50220316
Substrate/Competitorn/a
Meas. Tech.ChEMBL_449199 (CHEMBL899464)
IC50 6900±n/a nM
Citation Fobare, WFSolvibile, WRRobichaud, AJMalamas, MSManas, ETurner, JHu, YWagner, EChopra, RCowling, RJin, GBard, J Thiophene substituted acylguanidines as BACE1 inhibitors. Bioorg Med Chem Lett17:5353-6 (2007) 
 
Beta-secretase 1
Name:Beta-secretase 1
Type:Protein
Mol. Mass.:55755.10
Organism:Homo sapiens (Human)
Description:P56817
Residue:501
BDBM50220316
NameBDBM50220316
Synonyms:2-(2-(4-(2-(1H-pyrazol-4-yl)ethoxy)phenyl)-4-(2-chlorophenyl)thiophen-3-yl)-N-(diaminomethylene)acetamide | CHEMBL393559
TypeSmall organic molecule
Emp. Form.C24H22ClN5O2S
Mol. Mass.479.982
SMILESNC(=N)NC(=O)Cc1c(csc1-c1ccc(OCCc2cn[nH]c2)cc1)-c1ccccc1Cl