Reaction Details
TargetBeta-secretase 1
LigandBDBM50220318
Substrate/Competitorn/a
Meas. Tech.ChEMBL_449199 (CHEMBL899464)
IC50 750±n/a nM
Citation Fobare, WFSolvibile, WRRobichaud, AJMalamas, MSManas, ETurner, JHu, YWagner, EChopra, RCowling, RJin, GBard, J Thiophene substituted acylguanidines as BACE1 inhibitors. Bioorg Med Chem Lett17:5353-6 (2007) 
 
Beta-secretase 1
Name:Beta-secretase 1
Type:Protein
Mol. Mass.:55755.10
Organism:Homo sapiens (Human)
Description:P56817
Residue:501
BDBM50220318
NameBDBM50220318
Synonyms:2-(2-(4-(4-acetylphenoxy)phenyl)-4-(2-chlorophenyl)thiophen-3-yl)-N-(diaminomethylene)acetamide | CHEMBL236851
TypeSmall organic molecule
Emp. Form.C27H22ClN3O3S
Mol. Mass.504
SMILESCC(=O)c1ccc(Oc2ccc(cc2)-c2scc(c2CC(=O)NC(N)=N)-c2ccccc2Cl)cc1