Reaction Details
TargetKinesin-like protein KIF11
LigandBDBM50220323
Substrate/Competitorn/a
Meas. Tech.ChEMBL_449205 (CHEMBL898408)
IC50 1.8±n/a nM
Citation Coleman, PJSchreier, JDCox, CDFraley, MEGarbaccio, RMBuser, CAWalsh, ESHamilton, KLobell, RBRickert, KTao, WDiehl, RESouth, VJDavide, JPKohl, NEYan, YKuo, LPrueksaritanont, TLi, CMahan, EAFernandez-Metzler, CSalata, JJHartman, GD Kinesin spindle protein (KSP) inhibitors. Part 6: Design and synthesis of 3,5-diaryl-4,5-dihydropyrazole amides as potent inhibitors of the mitotic kinesin KSP. Bioorg Med Chem Lett17:5390-5 (2007) 
 
Kinesin-like protein KIF11
Name:Kinesin-like protein KIF11
Type:PROTEIN
Mol. Mass.:119138.97
Organism:Homo sapiens (Human)
Description:ChEMBL_1457426
Residue:1056
BDBM50220323
NameBDBM50220323
Synonyms:(S)-1-(3-(2,5-difluorophenyl)-5-(3-(3-fluoroazetidin-1-yl)propyl)-5-phenyl-4,5-dihydropyrazol-1-yl)ethanone | CHEMBL240498
TypeSmall organic molecule
Emp. Form.C23H24F3N3O
Mol. Mass.415.4514
SMILESCC(=O)N1N=C(C[C@@]1(CCCN1CC(F)C1)c1ccccc1)c1cc(F)ccc1F