Reaction Details
TargetGlycogen synthase kinase-3 beta
LigandBDBM50220369
Substrate/Competitorn/a
Meas. Tech.ChEMBL_457307 (CHEMBL941840)
IC50 25±n/a nM
Citation Shin, DLee, SCHeo, YSLee, WYCho, YSKim, YEHyun, YLCho, JMLee, YSRo, S Design and synthesis of 7-hydroxy-1H-benzoimidazole derivatives as novel inhibitors of glycogen synthase kinase-3beta. Bioorg Med Chem Lett17:5686-9 (2007) 
 
Glycogen synthase kinase-3 beta
Name:Glycogen synthase kinase-3 beta
Type:Enzyme
Mol. Mass.:46756.38
Organism:Homo sapiens (Human)
Description:P49841
Residue:420
BDBM50220369
NameBDBM50220369
Synonyms:CHEMBL399140 | N-(4-(methylsulfonamido)phenethyl)-7-hydroxy-2-phenyl-1H-benzo[d]imidazole-4-carboxamide
TypeSmall organic molecule
Emp. Form.C23H22N4O4S
Mol. Mass.450.51
SMILESCS(=O)(=O)Nc1ccc(CCNC(=O)c2ccc(O)c3nc([nH]c23)-c2ccccc2)cc1