Reaction Details
TargetGlycogen synthase kinase-3 beta
LigandBDBM50220374
Substrate/Competitorn/a
Meas. Tech.ChEMBL_457307 (CHEMBL941840)
IC50 870±n/a nM
Citation Shin, DLee, SCHeo, YSLee, WYCho, YSKim, YEHyun, YLCho, JMLee, YSRo, S Design and synthesis of 7-hydroxy-1H-benzoimidazole derivatives as novel inhibitors of glycogen synthase kinase-3beta. Bioorg Med Chem Lett17:5686-9 (2007) 
 
Glycogen synthase kinase-3 beta
Name:Glycogen synthase kinase-3 beta
Type:Enzyme
Mol. Mass.:46756.38
Organism:Homo sapiens (Human)
Description:P49841
Residue:420
BDBM50220374
NameBDBM50220374
Synonyms:CHEMBL250714 | N-benzyl-7-hydroxy-2-phenyl-1H-benzo[d]imidazole-4-carboxamide
TypeSmall organic molecule
Emp. Form.C21H17N3O2
Mol. Mass.343.3786
SMILESOc1ccc(C(=O)NCc2ccccc2)c2[nH]c(nc12)-c1ccccc1