Reaction Details
TargetAndrogen receptor
LigandBDBM50220379
Substrate/Competitorn/a
Meas. Tech.ChEMBL_449234 (CHEMBL899496)
IC50>1±n/a nM
Citation Van Camp, JAHu, LYKostlan, CLefker, BLi, JMitchell, LWang, ZYue, WSCarroll, MDettling, DDu, DPocalyko, DWade, K Preparation of 4-aryl-2-trifluoromethylbenzonitrile derivatives as androgen receptor antagonists for topical suppression of sebum production. Bioorg Med Chem Lett17:5529-32 (2007) 
 
Androgen receptor
Name:Androgen receptor
Type:Receptor
Mol. Mass.:99185.27
Organism:Homo sapiens (Human)
Description:CHO cells were stably transfected with human AR gene.
Residue:920
BDBM50220379
NameBDBM50220379
Synonyms:3,2'-bis-trifluoromethyl-biphenyl-4-carbonitrile | CHEMBL396656
TypeSmall organic molecule
Emp. Form.C15H7F6N
Mol. Mass.315.2132
SMILESFC(F)(F)c1cc(ccc1C#N)-c1ccccc1C(F)(F)F