Reaction Details
TargetProstaglandin G/H synthase 2
LigandBDBM22360
Substrate/Competitorn/a
Meas. Tech.ChEMBL_449250 (CHEMBL899512)
IC50 2400±n/a nM
Citation Abdellatif, KRDong, YChen, QHChowdhury, MAKnaus, EE Novel (E)-2-(aryl)-3-(4-methanesulfonylphenyl)acrylic ester prodrugs possessing a diazen-1-ium-1,2-diolate moiety: design, synthesis, cyclooxygenase inhibition, and nitric oxide release studies. Bioorg Med Chem15:6796-801 (2007) 
 
Prostaglandin G/H synthase 2
Name:Prostaglandin G/H synthase 2
Type:Protein
Mol. Mass.:68976.98
Organism:Ovis aries (Sheep)
Description:n/a
Residue:603
BDBM22360
NameBDBM22360
Synonyms:2-(acetyloxy)benzoate Acetylsalicylic acid Endosprin Zorprin cid_2244
TypeAnti-Inflammatory Agents, Non-Steroidal
Emp. Form.C9H8O4
Mol. Mass.180.1574
SMILESCC(=O)Oc1ccccc1C(O)=O