Reaction Details
TargetGlutamate receptor ionotropic, NMDA 2B
LigandBDBM50220589
Substrate/Competitorn/a
Meas. Tech.ChEMBL_457335 (CHEMBL940926)
IC50 6.3±n/a nM
Citation Kawai, MAndo, KMatsumoto, YSakurada, IHirota, MNakamura, HOhta, ASudo, MHattori, KTakashima, THizue, MWatanabe, SFujita, IMizutani, MKawamura, M Discovery of (-)-6-[2-[4-(3-fluorophenyl)-4-hydroxy-1-piperidinyl]-1-hydroxyethyl]-3,4-dihydro-2(1H)-quinolinone--a potent NR2B-selective N-methyl D-aspartate (NMDA) antagonist for the treatment of pain. Bioorg Med Chem Lett17:5558-62 (2007) 
 
Glutamate receptor ionotropic, NMDA 2B
Name:Glutamate receptor ionotropic, NMDA 2B
Type:Protein
Mol. Mass.:166077.66
Organism:Rattus norvegicus (Rat)
Description:Q00960
Residue:1482
BDBM50220589
NameBDBM50220589
Synonyms:6-(1-hydroxy-2-(4-hydroxy-4-(3-(phenoxymethyl)phenyl)piperidin-1-yl)propyl)-3,4-dihydroquinolin-2(1H)-one | CHEMBL247841
TypeSmall organic molecule
Emp. Form.C30H34N2O4
Mol. Mass.486.602
SMILESCC(C(O)c1ccc2NC(=O)CCc2c1)N1CCC(O)(CC1)c1cccc(COc2ccccc2)c1