Reaction Details
TargetGlutamate receptor ionotropic, NMDA 2B
LigandBDBM50220609
Substrate/Competitorn/a
Meas. Tech.ChEMBL_457343 (CHEMBL940934)
Ki>100±n/a nM
Citation Kawai, MSakurada, IMorita, AIwamuro, YAndo, KOmura, HSakakibara, SMasuda, TKoike, HHonma, THattori, KTakashima, TMizuno, KMizutani, MKawamura, M Structure-activity relationship study of novel NR2B-selective antagonists with arylamides to avoid reactive metabolites formation. Bioorg Med Chem Lett17:5537-42 (2007) 
 
Glutamate receptor ionotropic, NMDA 2B
Name:Glutamate receptor ionotropic, NMDA 2B
Type:Protein
Mol. Mass.:166077.66
Organism:Rattus norvegicus (Rat)
Description:Q00960
Residue:1482
BDBM50220609
NameBDBM50220609
Synonyms:3,5-dimethyl-N-(((1s,4s)-4-(2-phenoxyethyl)cyclohexyl)methyl)-1H-pyrazole-4-carboxamide | CHEMBL251496
TypeSmall organic molecule
Emp. Form.C21H29N3O2
Mol. Mass.355.4739
SMILESCc1n[nH]c(C)c1C(=O)NC[C@@H]1CC[C@H](CCOc2ccccc2)CC1