Reaction Details
TargetHydroxycarboxylic acid receptor 2
LigandBDBM50220852
Substrate/Competitorn/a
Meas. Tech.ChEMBL_449367 (CHEMBL899634)
EC50>1000±n/a nM
Citation Skinner, PJCherrier, MCWebb, PJShin, YJGharbaoui, TLindstrom, AHong, VTamura, SYDang, HTPride, CCChen, RRichman, JGConnolly, DTSemple, G Fluorinated pyrazole acids are agonists of the high affinity niacin receptor GPR109a. Bioorg Med Chem Lett17:5620-3 (2007) 
 
Hydroxycarboxylic acid receptor 2
Name:Hydroxycarboxylic acid receptor 2
Type:G Protein-Coupled Receptor (GPCR)
Mol. Mass.:41868.22
Organism:Homo sapiens (Human)
Description:Membranes from CHO cells expressing the recombinant human GPR109A were used in competition binding assay.
Residue:363
BDBM50220852
NameBDBM50220852
Synonyms:5-ethyl-4-methyl-1H-pyrazole-3-carboxylic acid | CHEMBL415261
TypeSmall organic molecule
Emp. Form.C7H10N2O2
Mol. Mass.154.1665
SMILESCCc1[nH]nc(C(O)=O)c1C