Reaction Details
TargetHydroxycarboxylic acid receptor 2
LigandBDBM50216539
Substrate/Competitorn/a
Meas. Tech.ChEMBL_449367 (CHEMBL899634)
EC50 79±n/a nM
Citation Skinner, PJCherrier, MCWebb, PJShin, YJGharbaoui, TLindstrom, AHong, VTamura, SYDang, HTPride, CCChen, RRichman, JGConnolly, DTSemple, G Fluorinated pyrazole acids are agonists of the high affinity niacin receptor GPR109a. Bioorg Med Chem Lett17:5620-3 (2007) 
 
Hydroxycarboxylic acid receptor 2
Name:Hydroxycarboxylic acid receptor 2
Type:G Protein-Coupled Receptor (GPCR)
Mol. Mass.:41868.22
Organism:Homo sapiens (Human)
Description:Membranes from CHO cells expressing the recombinant human GPR109A were used in competition binding assay.
Residue:363
BDBM50216539
NameBDBM50216539
Synonyms:3-ethyl-1H-pyrazole-5-carboxylic acid CHEMBL394498
TypeSmall organic molecule
Emp. Form.C6H8N2O2
Mol. Mass.140.1399
SMILESCCc1cc(n[nH]1)C(O)=O