Reaction Details
TargetHydroxycarboxylic acid receptor 2
LigandBDBM50220842
Substrate/Competitorn/a
Meas. Tech.ChEMBL_449367 (CHEMBL899634)
EC50 85±n/a nM
Citation Skinner, PJCherrier, MCWebb, PJShin, YJGharbaoui, TLindstrom, AHong, VTamura, SYDang, HTPride, CCChen, RRichman, JGConnolly, DTSemple, G Fluorinated pyrazole acids are agonists of the high affinity niacin receptor GPR109a. Bioorg Med Chem Lett17:5620-3 (2007) 
 
Hydroxycarboxylic acid receptor 2
Name:Hydroxycarboxylic acid receptor 2
Type:G Protein-Coupled Receptor (GPCR)
Mol. Mass.:41868.22
Organism:Homo sapiens (Human)
Description:Membranes from CHO cells expressing the recombinant human GPR109A were used in competition binding assay.
Residue:363
BDBM50220842
NameBDBM50220842
Synonyms:3-butyl-1H-pyrazole-5-carboxylic acid CHEMBL428730
TypeSmall organic molecule
Emp. Form.C8H12N2O2
Mol. Mass.168.1931
SMILESCCCCc1cc(n[nH]1)C(O)=O