Reaction Details
TargetHydroxycarboxylic acid receptor 2
LigandBDBM50220844
Substrate/Competitorn/a
Meas. Tech.ChEMBL_449367 (CHEMBL899634)
EC50>1000±n/a nM
Citation Skinner, PJCherrier, MCWebb, PJShin, YJGharbaoui, TLindstrom, AHong, VTamura, SYDang, HTPride, CCChen, RRichman, JGConnolly, DTSemple, G Fluorinated pyrazole acids are agonists of the high affinity niacin receptor GPR109a. Bioorg Med Chem Lett17:5620-3 (2007) 
 
Hydroxycarboxylic acid receptor 2
Name:Hydroxycarboxylic acid receptor 2
Type:G Protein-Coupled Receptor (GPCR)
Mol. Mass.:41868.22
Organism:Homo sapiens (Human)
Description:Membranes from CHO cells expressing the recombinant human GPR109A were used in competition binding assay.
Residue:363
BDBM50220844
NameBDBM50220844
Synonyms:5-(5-cyclopropyl-4-fluoro-1H-pyrazol-3-yl)-1H-tetrazole | CHEMBL236728
TypeSmall organic molecule
Emp. Form.C7H7FN6
Mol. Mass.194.1691
SMILESFc1c(n[nH]c1C1CC1)-c1nnn[nH]1