Reaction Details
TargetHydroxycarboxylic acid receptor 2
LigandBDBM50220850
Substrate/Competitorn/a
Meas. Tech.ChEMBL_449367 (CHEMBL899634)
EC50 182±n/a nM
Citation Skinner, PJCherrier, MCWebb, PJShin, YJGharbaoui, TLindstrom, AHong, VTamura, SYDang, HTPride, CCChen, RRichman, JGConnolly, DTSemple, G Fluorinated pyrazole acids are agonists of the high affinity niacin receptor GPR109a. Bioorg Med Chem Lett17:5620-3 (2007) 
 
Hydroxycarboxylic acid receptor 2
Name:Hydroxycarboxylic acid receptor 2
Type:G Protein-Coupled Receptor (GPCR)
Mol. Mass.:41868.22
Organism:Homo sapiens (Human)
Description:Membranes from CHO cells expressing the recombinant human GPR109A were used in competition binding assay.
Residue:363
BDBM50220850
NameBDBM50220850
Synonyms:3-propyl-1H-pyrazole-5-carboxylic acid CHEMBL237788
TypeSmall organic molecule
Emp. Form.C7H10N2O2
Mol. Mass.154.1665
SMILESCCCc1cc(n[nH]1)C(O)=O