Reaction Details
TargetBeta-2 adrenergic receptor
LigandBDBM50220910
Substrate/Competitorn/a
Meas. Tech.ChEMBL_449389 (CHEMBL899656)
Ki 3.8±n/a nM
Citation Krushinski, JHSchaus, JMThompson, DCCalligaro, DONelson, DLLuecke, SHWainscott, DBWong, DT Indoloxypropanolamine analogues as 5-HT(1A) receptor antagonists. Bioorg Med Chem Lett17:5600-4 (2007) 
 
Beta-2 adrenergic receptor
Name:Beta-2 adrenergic receptor
Type:n/a
Mol. Mass.:46461.69
Organism:Homo sapiens (Human)
Description:P07550
Residue:413
BDBM50220910
NameBDBM50220910
Synonyms:(S)-1-(1H-indol-4-yloxy)-3-(cyclohexylamino)propan-2-ol | CHEMBL393648
TypeSmall organic molecule
Emp. Form.C17H24N2O2
Mol. Mass.288.3847
SMILESO[C@@H](CNC1CCCCC1)COc1cccc2[nH]ccc12