Reaction Details
Target5-hydroxytryptamine receptor 1A
LigandBDBM50220912
Substrate/Competitorn/a
Meas. Tech.ChEMBL_449379 (CHEMBL899645)
Ki 11±n/a nM
Citation Krushinski, JHSchaus, JMThompson, DCCalligaro, DONelson, DLLuecke, SHWainscott, DBWong, DT Indoloxypropanolamine analogues as 5-HT(1A) receptor antagonists. Bioorg Med Chem Lett17:5600-4 (2007) 
 
5-hydroxytryptamine receptor 1A
Name:5-hydroxytryptamine receptor 1A
Type:n/a
Mol. Mass.:46122.49
Organism:Homo sapiens (Human)
Description:n/a
Residue:422
BDBM50220912
NameBDBM50220912
Synonyms:1-(1H-indol-4-yloxy)-3-(cycloheptylamino)propan-2-ol | CHEMBL237749
TypeSmall organic molecule
Emp. Form.C18H26N2O2
Mol. Mass.302.4112
SMILESOC(CNC1CCCCCC1)COc1cccc2[nH]ccc12