Reaction Details
TargetPotassium voltage-gated channel subfamily H member 2
LigandBDBM50220957
Substrate/Competitorn/a
Meas. Tech.ChEMBL_457444 (CHEMBL941016)
IC50 2400±n/a nM
Citation Garbaccio, RMTasber, ESNeilson, LAColeman, PJFraley, MEOlson, CBergman, JTorrent, MBuser, CARickert, KWalsh, ESHamilton, KLobell, RBTao, WSouth, VJDiehl, REDavide, JPYan, YKuo, LCLi, CPrueksaritanont, TFernandez-Metzler, CMahan, EASlaughter, DESalata, JJKohl, NEHuber, HEHartman, GD Kinesin spindle protein (KSP) inhibitors. Part 7: Design and synthesis of 3,3-disubstituted dihydropyrazolobenzoxazines as potent inhibitors of the mitotic kinesin KSP. Bioorg Med Chem Lett17:5671-6 (2007) 
 
Potassium voltage-gated channel subfamily H member 2
Name:Potassium voltage-gated channel subfamily H member 2
Type:Multi-pass membrane protein
Mol. Mass.:126672.65
Organism:Homo sapiens (Human)
Description:Q12809
Residue:1159
BDBM50220957
NameBDBM50220957
Synonyms:1-[(3R,3aR)-3-(3-dimethylamino-propyl)-8-methyl-3-phenyl-3a,4-dihydro-3H-5-oxa-1,9b-diaza-cyclopenta[a]naphthalen-2-yl]-ethanone | CHEMBL250532
TypeSmall organic molecule
Emp. Form.C24H29N3O2
Mol. Mass.391.506
SMILESCN(C)CCC[C@]1([C@@H]2COc3ccc(C)cc3N2N=C1C(C)=O)c1ccccc1