Reaction Details
TargetMelanocortin receptor 4
LigandBDBM50221115
Substrate/Competitorn/a
Meas. Tech.ChEMBL_449486 (CHEMBL899758)
IC50 99±n/a nM
Citation Jiang, WTucci, FCTran, JAFleck, BAWen, JMarkison, SMarinkovic, DChen, CWArellano, MHoare, SRJohns, MFoster, ACSaunders, JChen, C Pyrrolidinones as potent functional antagonists of the human melanocortin-4 receptor. Bioorg Med Chem Lett17:5610-3 (2007) 
 
Melanocortin receptor 4
Name:Melanocortin receptor 4
Type:Enzyme
Mol. Mass.:36949.50
Organism:Homo sapiens (Human)
Description:P32245
Residue:332
BDBM50221115
NameBDBM50221115
Synonyms:1-((R)-1-(4-(2-((S)-1-((2-aminoethyl)(methyl)amino)-3-methylbutyl)-6-fluorophenyl)piperazin-1-yl)-3-(2,4-dichlorophenyl)-1-oxopropan-2-yl)pyrrolidin-2-one | CHEMBL237365
TypeSmall organic molecule
Emp. Form.C31H42Cl2FN5O2
Mol. Mass.606.602
SMILESCC(C)C[C@H](N(C)CCN)c1cccc(F)c1N1CCN(CC1)C(=O)[C@@H](Cc1ccc(Cl)cc1Cl)N1CCCC1=O