Reaction Details
TargetMelanocortin receptor 4
LigandBDBM50221127
Substrate/Competitorn/a
Meas. Tech.ChEMBL_449486 (CHEMBL899758)
IC50 94±n/a nM
Citation Jiang, WTucci, FCTran, JAFleck, BAWen, JMarkison, SMarinkovic, DChen, CWArellano, MHoare, SRJohns, MFoster, ACSaunders, JChen, C Pyrrolidinones as potent functional antagonists of the human melanocortin-4 receptor. Bioorg Med Chem Lett17:5610-3 (2007) 
 
Melanocortin receptor 4
Name:Melanocortin receptor 4
Type:Enzyme
Mol. Mass.:36949.50
Organism:Homo sapiens (Human)
Description:P32245
Residue:332
BDBM50221127
NameBDBM50221127
Synonyms:3-amino-N-((S)-1-(2-(4-((R)-3-(2,4-dichlorophenyl)-2-(2-oxopyrrolidin-1-yl)propanoyl)piperazin-1-yl)phenyl)-3-methylbutyl)propanamide | CHEMBL391028
TypeSmall organic molecule
Emp. Form.C31H41Cl2N5O3
Mol. Mass.602.595
SMILESCC(C)C[C@H](NC(=O)CCN)c1ccccc1N1CCN(CC1)C(=O)[C@@H](Cc1ccc(Cl)cc1Cl)N1CCCC1=O