Reaction Details
TargetMelanocortin receptor 4
LigandBDBM50221141
Substrate/Competitorn/a
Meas. Tech.ChEMBL_449486 (CHEMBL899758)
IC50 52±n/a nM
Citation Jiang, WTucci, FCTran, JAFleck, BAWen, JMarkison, SMarinkovic, DChen, CWArellano, MHoare, SRJohns, MFoster, ACSaunders, JChen, C Pyrrolidinones as potent functional antagonists of the human melanocortin-4 receptor. Bioorg Med Chem Lett17:5610-3 (2007) 
 
Melanocortin receptor 4
Name:Melanocortin receptor 4
Type:Enzyme
Mol. Mass.:36949.50
Organism:Homo sapiens (Human)
Description:P32245
Residue:332
BDBM50221141
NameBDBM50221141
Synonyms:CHEMBL397583 | N-((S)-1-(2-(4-((R)-3-(2,4-dichlorophenyl)-2-(2-oxopyrrolidin-1-yl)propanoyl)piperazin-1-yl)-5-methylphenyl)-3-methylbutyl)-3-(methylamino)propanamide
TypeSmall organic molecule
Emp. Form.C33H45Cl2N5O3
Mol. Mass.630.648
SMILESCNCCC(=O)N[C@@H](CC(C)C)c1cc(C)ccc1N1CCN(CC1)C(=O)[C@@H](Cc1ccc(Cl)cc1Cl)N1CCCC1=O