Reaction Details
TargetMelanocortin receptor 4
LigandBDBM50221139
Substrate/Competitorn/a
Meas. Tech.ChEMBL_449484 (CHEMBL899759)
Ki 140±n/a nM
Citation Jiang, WTucci, FCTran, JAFleck, BAWen, JMarkison, SMarinkovic, DChen, CWArellano, MHoare, SRJohns, MFoster, ACSaunders, JChen, C Pyrrolidinones as potent functional antagonists of the human melanocortin-4 receptor. Bioorg Med Chem Lett17:5610-3 (2007) 
 
Melanocortin receptor 4
Name:Melanocortin receptor 4
Type:Enzyme
Mol. Mass.:36949.50
Organism:Homo sapiens (Human)
Description:P32245
Residue:332
BDBM50221139
NameBDBM50221139
Synonyms:2-((S)-1-(2-(4-((R)-3-(2,4-dichlorophenyl)-2-(2-oxopyrrolidin-1-yl)propanoyl)piperazin-1-yl)-5-fluorophenyl)-3-methylbutylamino)acetamide | CHEMBL393789
TypeSmall organic molecule
Emp. Form.C30H38Cl2FN5O3
Mol. Mass.606.559
SMILESCC(C)C[C@H](NCC(N)=O)c1cc(F)ccc1N1CCN(CC1)C(=O)[C@@H](Cc1ccc(Cl)cc1Cl)N1CCCC1=O