Reaction Details
TargetCathepsin S
LigandBDBM50221225
Substrate/Competitorn/a
Meas. Tech.ChEMBL_449532 (CHEMBL899800)
IC50 34±n/a nM
Citation Wei, JPio, BACai, HMeduna, SPSun, SGu, YJiang, WThurmond, RLKarlsson, LEdwards, JP Pyrazole-based cathepsin S inhibitors with improved cellular potency. Bioorg Med Chem Lett17:5525-8 (2007) 
 
Cathepsin S
Name:Cathepsin S
Type:Protein
Mol. Mass.:37507.38
Organism:Homo sapiens (Human)
Description:P25774
Residue:331
BDBM50221225
NameBDBM50221225
Synonyms:1-(4-(7-chloro-1H-indol-3-yl)piperidin-1-yl)-3-(5-(methylsulfonyl)-3-(4-(trifluoromethyl)phenyl)-4,5,6,7-tetrahydropyrazolo[4,3-c]pyridin-1-yl)propan-2-ol | CHEMBL269130
TypeSmall organic molecule
Emp. Form.C30H33ClF3N5O3S
Mol. Mass.636.128
SMILESCS(=O)(=O)N1CCc2c(C1)c(nn2CC(O)CN1CCC(CC1)c1c[nH]c2c(Cl)cccc12)-c1ccc(cc1)C(F)(F)F