Reaction Details
TargetTyrosine-protein kinase ABL1
LigandBDBM50221346
Substrate/Competitorn/a
Meas. Tech.ChEMBL_449566 (CHEMBL899836)
IC50>30000±n/a nM
Citation Johnson, NWSemones, MAdams, JLHansbury, MWinkler, J Optimization of triarylimidazoles for Tie2: influence of conformation on potency. Bioorg Med Chem Lett17:5514-7 (2007) 
 
Tyrosine-protein kinase ABL1
Name:Tyrosine-protein kinase ABL1
Type:Enzyme
Mol. Mass.:122897.30
Organism:Homo sapiens (Human)
Description:P00519
Residue:1130
BDBM50221346
NameBDBM50221346
Synonyms:4-[2-(4-methanesulfinyl-2-methyl-phenyl)-5-(6-methoxy-naphthalen-2-yl)-1-methyl-3H-imidazol-4-yl]-pyridine | CHEMBL237570
TypeSmall organic molecule
Emp. Form.C28H25N3O2S
Mol. Mass.467.582
SMILESCOc1ccc2cc(ccc2c1)-c1c(nc(-c2ccc(cc2C)S(C)=O)n1C)-c1ccncc1