Reaction Details
TargetAngiopoietin-1 receptor
LigandBDBM50221356
Substrate/Competitorn/a
Meas. Tech.ChEMBL_449556 (CHEMBL899826)
IC50 78±n/a nM
Citation Johnson, NWSemones, MAdams, JLHansbury, MWinkler, J Optimization of triarylimidazoles for Tie2: influence of conformation on potency. Bioorg Med Chem Lett17:5514-7 (2007) 
 
Angiopoietin-1 receptor
Name:Angiopoietin-1 receptor
Type:Enzyme
Mol. Mass.:125835.70
Organism:Homo sapiens (Human)
Description:Q02763
Residue:1124
BDBM50221356
NameBDBM50221356
Synonyms:4-(2-(2,6-dichlorophenyl)-4-(6-methoxynaphthalen-2-yl)-1H-imidazol-5-yl)pyridine | CHEMBL236503
TypeSmall organic molecule
Emp. Form.C25H17Cl2N3O
Mol. Mass.446.328
SMILESCOc1ccc2cc(ccc2c1)-c1[nH]c(nc1-c1ccncc1)-c1c(Cl)cccc1Cl