Reaction Details
TargetMu-type opioid receptor
LigandBDBM50221429
Substrate/Competitorn/a
Meas. Tech.ChEMBL_449624 (CHEMBL898721)
Ki 0.550000±n/a nM
Citation Shiotani, KLi, TMiyazaki, ATsuda, YYokoi, TAmbo, ASasaki, YBryant, SDLazarus, LHOkada, Y Design and synthesis of opioidmimetics containing 2',6'-dimethyl-L-tyrosine and a pyrazinone-ring platform. Bioorg Med Chem Lett17:5768-71 (2007) 
 
Mu-type opioid receptor
Name:Mu-type opioid receptor
Type:G Protein-Coupled Receptor (GPCR)
Mol. Mass.:44789.51
Organism:Homo sapiens (Human)
Description:P35372
Residue:400
BDBM50221429
NameBDBM50221429
Synonyms:(S)-2-amino-3-(4-hydroxy-2,6-dimethylphenyl)-N-(3-(6-methyl-3-oxo-5-phenethyl-3,4-dihydropyrazin-2-yl)propyl)propanamide | CHEMBL236462
TypeSmall organic molecule
Emp. Form.C27H34N4O3
Mol. Mass.462.5839
SMILESCc1cc(O)cc(C)c1C[C@H](N)C(=O)NCCCc1nc(C)c(CCc2ccccc2)[nH]c1=O