Reaction Details
TargetMu-type opioid receptor
LigandBDBM50221424
Substrate/Competitorn/a
Meas. Tech.ChEMBL_449624 (CHEMBL898721)
Ki 1±n/a nM
Citation Shiotani, KLi, TMiyazaki, ATsuda, YYokoi, TAmbo, ASasaki, YBryant, SDLazarus, LHOkada, Y Design and synthesis of opioidmimetics containing 2',6'-dimethyl-L-tyrosine and a pyrazinone-ring platform. Bioorg Med Chem Lett17:5768-71 (2007) 
 
Mu-type opioid receptor
Name:Mu-type opioid receptor
Type:G Protein-Coupled Receptor (GPCR)
Mol. Mass.:44789.51
Organism:Homo sapiens (Human)
Description:P35372
Residue:400
BDBM50221424
NameBDBM50221424
Synonyms:(S)-2-amino-N-(3-(5-benzyl-6-methyl-3-oxo-3,4-dihydropyrazin-2-yl)propyl)-3-(4-hydroxy-2,6-dimethylphenyl)propanamide | CHEMBL236461
TypeSmall organic molecule
Emp. Form.C26H32N4O3
Mol. Mass.448.5573
SMILESCc1cc(O)cc(C)c1C[C@H](N)C(=O)NCCCc1nc(C)c(Cc2ccccc2)[nH]c1=O