Reaction Details
TargetAndrogen receptor
LigandBDBM50221436
Substrate/Competitorn/a
Meas. Tech.ChEMBL_457596 (CHEMBL923797)
IC50 13±n/a nM
Citation Hu, LYDu, DHoffman, JSmith, YFedij, VKostlan, CJohnson, TRHuang, YKesten, SHarter, WYue, WSLi, JJBarvian, NMitchell, LLei, HJLefker, BCarroll, MDettling, DKrieger-Burke, TSamas, BYalamanchili, RLapham, KPocalyko, DSliskovic, DCiotti, SStoller, BHena, MADing, QMaiti, SNStier, MWelgus, H (1R,2S)-4-(2-cyano-cyclohexyl-oxy)-2-trifluoromethyl-benzonitrile, a potent androgen receptor antagonist for stimulating hair growth and reducing sebum production. Bioorg Med Chem Lett17:5983-8 (2007) 
 
Androgen receptor
Name:Androgen receptor
Type:Receptor
Mol. Mass.:99185.27
Organism:Homo sapiens (Human)
Description:CHO cells were stably transfected with human AR gene.
Residue:920
BDBM50221436
NameBDBM50221436
Synonyms:4-(2-cyano-cyclohexyl-oxy)-2-trifluoromethyl-benzonitrile | CHEMBL251552
TypeSmall organic molecule
Emp. Form.C15H13F3N2O
Mol. Mass.294.2717
SMILESFC(F)(F)c1cc(OC2CCCCC2C#N)ccc1C#N