Reaction Details
TargetDipeptidyl peptidase 4
LigandBDBM50221442
Substrate/Competitorn/a
Meas. Tech.ChEMBL_457605 (CHEMBL923806)
IC50 4±n/a nM
Citation Kowalchick, JELeiting, BPryor, KDMarsilio, FWu, JKHe, HLyons, KAEiermann, GJPetrov, AScapin, GPatel, RAThornberry, NAWeber, AEKim, D Design, synthesis, and biological evaluation of triazolopiperazine-based beta-amino amides as potent, orally active dipeptidyl peptidase IV (DPP-4) inhibitors. Bioorg Med Chem Lett17:5934-9 (2007) 
 
Dipeptidyl peptidase 4
Name:Dipeptidyl peptidase 4
Type:Enzyme
Mol. Mass.:88271.01
Organism:Homo sapiens (Human)
Description:P27487
Residue:766
BDBM50221442
NameBDBM50221442
Synonyms:(3R)-1-(8-((1H-pyrazol-1-yl)methyl)-2-(trifluoromethyl)-5,6-dihydro-[1,2,4]triazolo[1,5-a]pyrazin-7(8H)-yl)-3-amino-4-(2,4,5-trifluorophenyl)butan-1-one | CHEMBL250351
TypeSmall organic molecule
Emp. Form.C20H19F6N7O
Mol. Mass.487.4016
SMILESN[C@@H](CC(=O)N1CCn2nc(nc2C1Cn1cccn1)C(F)(F)F)Cc1cc(F)c(F)cc1F