Reaction Details
TargetEpidermal growth factor receptor
LigandBDBM50221522
Substrate/Competitorn/a
Meas. Tech.ChEMBL_457644 (CHEMBL923921)
Ki 40±n/a nM
Citation Pannala, MKher, SWilson, NGaudette, JSircar, IZhang, SHBakhirev, AYang, GYuen, PGorcsan, FSakurai, NBarbosa, MCheng, JF Synthesis and structure-activity relationship of 4-(2-aryl-cyclopropylamino)-quinoline-3-carbonitriles as EGFR tyrosine kinase inhibitors. Bioorg Med Chem Lett17:5978-82 (2007) 
 
Epidermal growth factor receptor
Name:Epidermal growth factor receptor
Type:Receptor Kinase Domain
Mol. Mass.:134279.59
Organism:Homo sapiens (Human)
Description:P00533
Residue:1210
BDBM50221522
NameBDBM50221522
Synonyms:6-(4-(aminomethyl)phenyl)-4-((1R,2S)-2-phenylcyclopropylamino)quinoline-3-carbonitrile | CHEMBL245800
TypeSmall organic molecule
Emp. Form.C26H22N4
Mol. Mass.390.4797
SMILESNCc1ccc(cc1)-c1ccc2ncc(C#N)c(N[C@@H]3C[C@H]3c3ccccc3)c2c1