Reaction Details
TargetEpidermal growth factor receptor
LigandBDBM50221516
Substrate/Competitorn/a
Meas. Tech.ChEMBL_457644 (CHEMBL923921)
Ki 8.4±n/a nM
Citation Pannala, MKher, SWilson, NGaudette, JSircar, IZhang, SHBakhirev, AYang, GYuen, PGorcsan, FSakurai, NBarbosa, MCheng, JF Synthesis and structure-activity relationship of 4-(2-aryl-cyclopropylamino)-quinoline-3-carbonitriles as EGFR tyrosine kinase inhibitors. Bioorg Med Chem Lett17:5978-82 (2007) 
 
Epidermal growth factor receptor
Name:Epidermal growth factor receptor
Type:Receptor Kinase Domain
Mol. Mass.:134279.59
Organism:Homo sapiens (Human)
Description:P00533
Residue:1210
BDBM50221516
NameBDBM50221516
Synonyms:6-methoxy-7-(3-morpholinopropoxy)-4-((1R,2S)-2-phenylcyclopropylamino)quinoline-3-carbonitrile | CHEMBL248392
TypeSmall organic molecule
Emp. Form.C27H30N4O3
Mol. Mass.458.5521
SMILESCOc1cc2c(N[C@@H]3C[C@H]3c3ccccc3)c(cnc2cc1OCCCN1CCOCC1)C#N