Reaction Details
TargetVascular endothelial growth factor receptor 1
LigandBDBM50221531
Substrate/Competitorn/a
Meas. Tech.ChEMBL_457648 (CHEMBL923925)
Ki 110±n/a nM
Citation Pannala, MKher, SWilson, NGaudette, JSircar, IZhang, SHBakhirev, AYang, GYuen, PGorcsan, FSakurai, NBarbosa, MCheng, JF Synthesis and structure-activity relationship of 4-(2-aryl-cyclopropylamino)-quinoline-3-carbonitriles as EGFR tyrosine kinase inhibitors. Bioorg Med Chem Lett17:5978-82 (2007) 
 
Vascular endothelial growth factor receptor 1
Name:Vascular endothelial growth factor receptor 1
Type:Receptor Tyrosine Kinase
Mol. Mass.:150800.23
Organism:Homo sapiens (Human)
Description:P17948
Residue:1338
BDBM50221531
NameBDBM50221531
Synonyms:6-methoxy-7-(3-(4-methylpiperazin-1-yl)propoxy)-4-((1R,2S)-2-phenylcyclopropylamino)quinoline-3-carbonitrile | CHEMBL248393
TypeSmall organic molecule
Emp. Form.C28H33N5O2
Mol. Mass.471.5939
SMILESCOc1cc2c(N[C@@H]3C[C@H]3c3ccccc3)c(cnc2cc1OCCCN1CCN(C)CC1)C#N