Reaction Details
TargetTyrosine-protein kinase ABL1
LigandBDBM50221557
Substrate/Competitorn/a
Meas. Tech.ChEMBL_457651 (CHEMBL923928)
Ki 0.5±n/a nM
Citation Cao, JFine, RGritzen, CHood, JKang, XKlebansky, BLohse, DMak, CCMcPherson, ANoronha, GPalanki, MSPathak, VPRenick, JSoll, RZeng, BZhu, H The design and preliminary structure-activity relationship studies of benzotriazines as potent inhibitors of Abl and Abl-T315I enzymes. Bioorg Med Chem Lett17:5812-8 (2007) 
 
Tyrosine-protein kinase ABL1
Name:Tyrosine-protein kinase ABL1
Type:Enzyme
Mol. Mass.:122897.30
Organism:Homo sapiens (Human)
Description:P00519
Residue:1130
BDBM50221557
NameBDBM50221557
Synonyms:(4-(7-(2-chloro-5-hydroxyphenyl)-5-methylbenzo[e][1,2,4]triazin-3-ylamino)phenyl)(4-methylpiperazin-1-yl)methanone US8481536, 504
TypeSmall organic molecule
Emp. Form.C26H25ClN6O2
Mol. Mass.488.969
SMILESCN1CCN(CC1)C(=O)c1ccc(Nc2nnc3cc(cc(C)c3n2)-c2cc(O)ccc2Cl)cc1