Reaction Details
TargetCannabinoid receptor 1
LigandBDBM50221710
Substrate/Competitorn/a
Meas. Tech.ChEMBL_457679 (CHEMBL923956)
Ki 8.55±n/a nM
Citation Bourne, CRoy, SWiley, JLMartin, BRThomas, BFMahadevan, ARazdan, RK Novel, potent THC/anandamide (hybrid) analogs. Bioorg Med Chem15:7850-64 (2007) 
 
Cannabinoid receptor 1
Name:Cannabinoid receptor 1
Type:G Protein-Coupled Receptor (GPCR)
Mol. Mass.:52868.96
Organism:Homo sapiens (Human)
Description:P21554
Residue:472
BDBM50221710
NameBDBM50221710
Synonyms:11-[3-(1,1-dimethylheptyl)phenoxy]undeca-5,8-dienoic acid [R(1-hydroxypropan-2-yl)]-amide | CHEMBL391858
TypeSmall organic molecule
Emp. Form.C29H47NO3
Mol. Mass.457.6884
SMILESCCCCCCC(C)(C)c1cccc(OCC\C=C/C\C=C/CCCC(=O)N[C@H](C)CO)c1