Reaction Details
TargetCannabinoid receptor 2
LigandBDBM50221713
Substrate/Competitorn/a
Meas. Tech.ChEMBL_457680 (CHEMBL925003)
Ki 10.9±n/a nM
Citation Bourne, CRoy, SWiley, JLMartin, BRThomas, BFMahadevan, ARazdan, RK Novel, potent THC/anandamide (hybrid) analogs. Bioorg Med Chem15:7850-64 (2007) 
 
Cannabinoid receptor 2
Name:Cannabinoid receptor 2
Type:G Protein-Coupled Receptor (GPCR)
Mol. Mass.:39690.94
Organism:Homo sapiens (Human)
Description:P34972
Residue:360
BDBM50221713
NameBDBM50221713
Synonyms:11-[3-(5-hydroxy-1,1-dimethylpentyl)phenoxy]-undeca-5,8-dienoic acid [R-(1-hydroxypropan-2-yl)]amide | CHEMBL240313
TypeSmall organic molecule
Emp. Form.C27H43NO4
Mol. Mass.445.6346
SMILESC[C@H](CO)NC(=O)CCC\C=C/C\C=C/CCOc1cccc(c1)C(C)(C)CCCCO