Reaction Details
TargetCannabinoid receptor 2
LigandBDBM50221709
Substrate/Competitorn/a
Meas. Tech.ChEMBL_457680 (CHEMBL925003)
Ki 189±n/a nM
Citation Bourne, CRoy, SWiley, JLMartin, BRThomas, BFMahadevan, ARazdan, RK Novel, potent THC/anandamide (hybrid) analogs. Bioorg Med Chem15:7850-64 (2007) 
 
Cannabinoid receptor 2
Name:Cannabinoid receptor 2
Type:G Protein-Coupled Receptor (GPCR)
Mol. Mass.:39690.94
Organism:Homo sapiens (Human)
Description:P34972
Residue:360
BDBM50221709
NameBDBM50221709
Synonyms:(5Z,8Z,11Z)-N-((R)-1-hydroxypropan-2-yl)-14-(3-(2-methyloctan-2-yl)phenoxy)tetradeca-5,8,11-trienamide | CHEMBL240527
TypeSmall organic molecule
Emp. Form.C32H51NO3
Mol. Mass.497.7522
SMILESCCCCCCC(C)(C)c1cccc(OCC\C=C/C\C=C/C\C=C/CCCC(=O)N[C@H](C)CO)c1