Reaction Details
TargetCannabinoid receptor 2
LigandBDBM50221710
Substrate/Competitorn/a
Meas. Tech.ChEMBL_457680 (CHEMBL925003)
Ki 21.48±n/a nM
Citation Bourne, CRoy, SWiley, JLMartin, BRThomas, BFMahadevan, ARazdan, RK Novel, potent THC/anandamide (hybrid) analogs. Bioorg Med Chem15:7850-64 (2007) 
 
Cannabinoid receptor 2
Name:Cannabinoid receptor 2
Type:G Protein-Coupled Receptor (GPCR)
Mol. Mass.:39690.94
Organism:Homo sapiens (Human)
Description:P34972
Residue:360
BDBM50221710
NameBDBM50221710
Synonyms:11-[3-(1,1-dimethylheptyl)phenoxy]undeca-5,8-dienoic acid [R(1-hydroxypropan-2-yl)]-amide | CHEMBL391858
TypeSmall organic molecule
Emp. Form.C29H47NO3
Mol. Mass.457.6884
SMILESCCCCCCC(C)(C)c1cccc(OCC\C=C/C\C=C/CCCC(=O)N[C@H](C)CO)c1