Reaction Details
TargetATP-dependent translocase ABCB1
LigandBDBM50221819
Substrate/Competitorn/a
Meas. Tech.ChEMBL_446267 (CHEMBL895371)
Ki 1450±n/a nM
Citation Reyes, CPMuñoz-Martínez, FTorrecillas, IRMendoza, CRGamarro, FBazzocchi, ILNúñez, MJPardo, LCastanys, SCampillo, MJiménez, IA Biological evaluation, structure-activity relationships, and three-dimensional quantitative structure-activity relationship studies of dihydro-beta-agarofuran sesquiterpenes as modulators of P-glycoprotein-dependent multidrug resistance. J Med Chem50:4808-17 (2007) 
 
ATP-dependent translocase ABCB1
Name:ATP-dependent translocase ABCB1
Type:Protein
Mol. Mass.:141503.50
Organism:Homo sapiens (Human)
Description:P08183
Residue:1280
BDBM50221819
NameBDBM50221819
Synonyms:CHEMBL234548 | nicotinic acid (1R,2R,3S,4S,5R,6R,7R,8S,9S)-3,4-diacetoxy-7,8-bis-benzoyloxy-2-hydroxy-2,6,10,10-tetramethyl-11-oxa-tricyclo[7.2.1.0*1,6*]dodec-5-yl ester
TypeSmall organic molecule
Emp. Form.C39H41NO12
Mol. Mass.715.7423
SMILESCC(=O)O[C@@H]1[C@H](OC(C)=O)[C@@](C)(O)[C@@]23C[C@@H]([C@H](OC(=O)c4ccccc4)[C@H](OC(=O)c4ccccc4)[C@]2(C)[C@H]1OC(=O)c1cccnc1)C(C)(C)O3