Reaction Details
TargetATP-dependent translocase ABCB1
LigandBDBM50221822
Substrate/Competitorn/a
Meas. Tech.ChEMBL_446267 (CHEMBL895371)
Ki 2810±n/a nM
Citation Reyes, CPMuñoz-Martínez, FTorrecillas, IRMendoza, CRGamarro, FBazzocchi, ILNúñez, MJPardo, LCastanys, SCampillo, MJiménez, IA Biological evaluation, structure-activity relationships, and three-dimensional quantitative structure-activity relationship studies of dihydro-beta-agarofuran sesquiterpenes as modulators of P-glycoprotein-dependent multidrug resistance. J Med Chem50:4808-17 (2007) 
 
ATP-dependent translocase ABCB1
Name:ATP-dependent translocase ABCB1
Type:Protein
Mol. Mass.:141503.50
Organism:Homo sapiens (Human)
Description:P08183
Residue:1280
BDBM50221822
NameBDBM50221822
Synonyms:CHEMBL232872 | furan-2-carboxylic acid (1S,2R,4S,5R,6R,7S,9R,12R)-4,5-diacetoxy-2-hydroxy-2,6,10,10-tetramethyl-12-pentyloxy-11-oxa-tricyclo[7.2.1.0*1,6*]dodec-7-yl ester
TypeSmall organic molecule
Emp. Form.C29H42O10
Mol. Mass.550.6378
SMILESCCCCCO[C@@H]1[C@H]2C[C@H](OC(=O)c3ccco3)[C@]3(C)[C@@H](OC(C)=O)[C@H](C[C@@](C)(O)[C@@]13OC2(C)C)OC(C)=O